Reaction Details
TargetSodium-dependent dopamine transporter
LigandBDBM50014232
Substrate/Competitorn/a
Meas. Tech.ChEMBL_131453 (CHEMBL740208)
Ki 1±n/a nM
Citation Maryanoff, BEVaught, JLShank, RPMcComsey, DFCostanzo, MJNortey, SO Pyrroloisoquinoline antidepressants. 3. A focus on serotonin. J Med Chem33:2793-7 (1990) Sodium-dependent dopamine transporter
Name:Sodium-dependent dopamine transporter
Type:Enzyme Catalytic Domain
Mol. Mass.:68809.06
Organism:MOUSE
Description:Dopamine Transporter SLC6A3 MOUSE::Q61327
Residue:619
BDBM50014232
NameBDBM50014232
Synonyms:6-(4-Ethynyl-phenyl)-1,2,3,5,6,10b-hexahydro-pyrrolo[2,1-a]isoquinoline | CHEMBL330666
TypeSmall organic molecule
Emp. Form.C20H19N
Mol. Mass.273.3716
SMILESC#Cc1ccc(cc1)C1CN2CCCC2c2ccccc12