Reaction Details
TargetSodium-dependent dopamine transporter
LigandBDBM50014245
Substrate/Competitorn/a
Meas. Tech.ChEMBL_131451 (CHEMBL740206)
Ki 11±n/a nM
Citation Maryanoff, BEVaught, JLShank, RPMcComsey, DFCostanzo, MJNortey, SO Pyrroloisoquinoline antidepressants. 3. A focus on serotonin. J Med Chem33:2793-7 (1990) Sodium-dependent dopamine transporter
Name:Sodium-dependent dopamine transporter
Type:Enzyme Catalytic Domain
Mol. Mass.:68809.06
Organism:MOUSE
Description:Dopamine Transporter SLC6A3 MOUSE::Q61327
Residue:619
BDBM50014245
NameBDBM50014245
Synonyms:6-Phenyl-1,2,3,5,6,10b-hexahydro-pyrrolo[2,1-a]isoquinoline | CHEMBL35184
TypeSmall organic molecule
Emp. Form.C18H19N
Mol. Mass.249.3502
SMILES[H][C@]12CCCN1C[C@@]([H])(c1ccccc1)c1ccccc21