Reaction Details
TargetSerine protease 1
LigandBDBM50014339
Substrate/Competitorn/a
Meas. Tech.ChEMBL_212532 (CHEMBL815752)
Ki 352000±n/a nM
Citation Yang, HHenkin, JKim, KHGreer, J Selective inhibition of urokinase by substituted phenylguanidines: quantitative structure-activity relationship analyses. J Med Chem33:2956-61 (1990) Serine protease 1
Name:Serine protease 1
Type:Enzyme
Mol. Mass.:25790.52
Organism:Bos taurus (bovine)
Description:P00760
Residue:246
BDBM50014339
NameBDBM50014339
Synonyms:1N-amino(immino)methyl-4-nitroaniline
TypeSmall organic molecule
Emp. Form.C7H9N4O2
Mol. Mass.181.1714
SMILESNC(=[NH2+])Nc1ccc(cc1)[N+]([O-])=O