Reaction Details
TargetUrokinase-type plasminogen activator
LigandBDBM50053590
Substrate/Competitorn/a
Meas. Tech.ChEMBL_213296 (CHEMBL814351)
Ki 6067±n/a nM
Citation Yang, HHenkin, JKim, KHGreer, J Selective inhibition of urokinase by substituted phenylguanidines: quantitative structure-activity relationship analyses. J Med Chem33:2956-61 (1990) Urokinase-type plasminogen activator
Name:Urokinase-type plasminogen activator
Type:Enzyme
Mol. Mass.:48528.62
Organism:Homo sapiens (Human)
Description:P00749
Residue:431
BDBM50053590
NameBDBM50053590
Synonyms:1N-amino(immino)methyl-4-chloroaniline N-(4-Chloro-phenyl)-guanidine | N-(4-chlorophenyl)guanidine
TypeSmall organic molecule
Emp. Form.C7H8ClN3
Mol. Mass.169.612
SMILES[#7]\[#6](-[#7])=[#7]\c1ccc(Cl)cc1