Reaction Details
TargetUrokinase-type plasminogen activator
LigandBDBM50014339
Substrate/Competitorn/a
Meas. Tech.ChEMBL_213160 (CHEMBL816645)
Ki 20600±n/a nM
Citation Yang, HHenkin, JKim, KHGreer, J Selective inhibition of urokinase by substituted phenylguanidines: quantitative structure-activity relationship analyses. J Med Chem33:2956-61 (1990) Urokinase-type plasminogen activator
Name:Urokinase-type plasminogen activator
Type:Enzyme
Mol. Mass.:48528.62
Organism:Homo sapiens (Human)
Description:P00749
Residue:431
BDBM50014339
NameBDBM50014339
Synonyms:1N-amino(immino)methyl-4-nitroaniline
TypeSmall organic molecule
Emp. Form.C7H9N4O2
Mol. Mass.181.1714
SMILESNC(=[NH2+])Nc1ccc(cc1)[N+]([O-])=O