Reaction Details
TargetUrokinase-type plasminogen activator
LigandBDBM50014326
Substrate/Competitorn/a
Meas. Tech.ChEMBL_213296 (CHEMBL814351)
Ki 90782±n/a nM
Citation Yang, HHenkin, JKim, KHGreer, J Selective inhibition of urokinase by substituted phenylguanidines: quantitative structure-activity relationship analyses. J Med Chem33:2956-61 (1990) Urokinase-type plasminogen activator
Name:Urokinase-type plasminogen activator
Type:Enzyme
Mol. Mass.:48528.62
Organism:Homo sapiens (Human)
Description:P00749
Residue:431
BDBM50014326
NameBDBM50014326
Synonyms:1N-amino(immino)methyl-4-ethylaniline
TypeSmall organic molecule
Emp. Form.C9H14N3
Mol. Mass.164.227
SMILESCCc1ccc(NC(N)=[NH2+])cc1