Reaction Details
TargetSerine protease 1
LigandBDBM50014330
Substrate/Competitorn/a
Meas. Tech.ChEBML_212532
Ki 651628±n/a nM
Citation Yang, HHenkin, JKim, KHGreer, J Selective inhibition of urokinase by substituted phenylguanidines: quantitative structure-activity relationship analyses. J Med Chem33:2956-61 (1990) Serine protease 1
Name:Serine protease 1
Type:Enzyme
Mol. Mass.:25790.52
Organism:Bos taurus (bovine)
Description:P00760
Residue:246
BDBM50014330
NameBDBM50014330
Synonyms:methyl 4-amino(immino)methylaminobenzoate
TypeSmall organic molecule
Emp. Form.C9H12N3O2
Mol. Mass.194.2099
SMILESCOC(=O)c1ccc(NC(N)=[NH2+])cc1