Reaction Details
TargetUrokinase-type plasminogen activator
LigandBDBM50014343
Substrate/Competitorn/a
Meas. Tech.ChEBML_213160
Ki 30700±n/a nM
Citation Yang, HHenkin, JKim, KHGreer, J Selective inhibition of urokinase by substituted phenylguanidines: quantitative structure-activity relationship analyses. J Med Chem33:2956-61 (1990) Urokinase-type plasminogen activator
Name:Urokinase-type plasminogen activator
Type:Enzyme
Mol. Mass.:48528.62
Organism:Homo sapiens (Human)
Description:P00749
Residue:431
BDBM50014343
NameBDBM50014343
Synonyms:1N-amino(immino)methyl-4-bromoaniline
TypeSmall organic molecule
Emp. Form.C7H9BrN3
Mol. Mass.215.07
SMILESNC(=[NH2+])Nc1ccc(Br)cc1