Reaction Details
TargetUrokinase-type plasminogen activator
LigandBDBM50014344
Substrate/Competitorn/a
Meas. Tech.ChEBML_213160
Ki 72400±n/a nM
Citation Yang, HHenkin, JKim, KHGreer, J Selective inhibition of urokinase by substituted phenylguanidines: quantitative structure-activity relationship analyses. J Med Chem33:2956-61 (1990) Urokinase-type plasminogen activator
Name:Urokinase-type plasminogen activator
Type:Enzyme
Mol. Mass.:48528.62
Organism:Homo sapiens (Human)
Description:P00749
Residue:431
BDBM50014344
NameBDBM50014344
Synonyms:1N-amino(immino)methyl-4-fluoroaniline
TypeSmall organic molecule
Emp. Form.C7H9FN3
Mol. Mass.154.1643
SMILESNC(=[NH2+])Nc1ccc(F)cc1