Reaction Details
TargetUrokinase-type plasminogen activator
LigandBDBM50053603
Substrate/Competitorn/a
Meas. Tech.ChEBML_213160
Ki 418794±n/a nM
Citation Yang, HHenkin, JKim, KHGreer, J Selective inhibition of urokinase by substituted phenylguanidines: quantitative structure-activity relationship analyses. J Med Chem33:2956-61 (1990) Urokinase-type plasminogen activator
Name:Urokinase-type plasminogen activator
Type:Enzyme
Mol. Mass.:48528.62
Organism:Homo sapiens (Human)
Description:P00749
Residue:431
BDBM50053603
NameBDBM50053603
Synonyms:1N-amino(immino)methyl-3-trifluoromethylaniline N-(3-Trifluoromethyl-phenyl)-guanidine | N-[3-(trifluoromethyl)phenyl]guanidine
TypeSmall organic molecule
Emp. Form.C8H8F3N3
Mol. Mass.203.1644
SMILES[#7]\[#6](-[#7])=[#7]\c1cccc(c1)C(F)(F)F