Reaction Details
TargetKappa-type opioid receptor
LigandBDBM50003747
Substrate/Competitorn/a
Meas. Tech.ChEMBL_146232 (CHEMBL755001)
Ki 3793±n/a nM
Citation de Costa, BRRice, KCBowen, WDThurkauf, ARothman, RBBand, LJacobson, AERadesca, LContreras, PCGray, NM Synthesis and evaluation of N-substituted cis-N-methyl-2-(1-pyrrolidinyl)cyclohexylamines as high affinity sigma receptor ligands. Identification of a new class of highly potent and selective sigma receptor probes. J Med Chem33:3100-10 (1990) Kappa-type opioid receptor
Name:Kappa-type opioid receptor
Type:G Protein-Coupled Receptor (GPCR)
Mol. Mass.:42744.99
Organism:Cavia porcellus (domestic guinea pig)
Description:P41144
Residue:380
BDBM50003747
NameBDBM50003747
Synonyms:(+)-[2-(3,4-Dichloro-phenyl)-ethyl]-methyl-(2-pyrrolidin-1-yl-cyclohexyl)-amine [2-(3,4-Dichloro-phenyl)-ethyl]-methyl-(2-pyrrolidin-1-yl-cyclohexyl)-amine
TypeSmall organic molecule
Emp. Form.C19H28Cl2N2
Mol. Mass.355.345
SMILESCN(CCc1ccc(Cl)c(Cl)c1)[C@@H]1CCCC[C@@H]1N1CCCC1