Reaction Details
TargetKappa-type opioid receptor
LigandBDBM50013968
Substrate/Competitorn/a
Meas. Tech.ChEBML_146231
Ki 523±n/a nM
Citation de Costa, BRRice, KCBowen, WDThurkauf, ARothman, RBBand, LJacobson, AERadesca, LContreras, PCGray, NM Synthesis and evaluation of N-substituted cis-N-methyl-2-(1-pyrrolidinyl)cyclohexylamines as high affinity sigma receptor ligands. Identification of a new class of highly potent and selective sigma receptor probes. J Med Chem33:3100-10 (1990) Kappa-type opioid receptor
Name:Kappa-type opioid receptor
Type:G Protein-Coupled Receptor (GPCR)
Mol. Mass.:42744.99
Organism:Cavia porcellus (domestic guinea pig)
Description:P41144
Residue:380
BDBM50013968
NameBDBM50013968
Synonyms:2-(2-Amino-4,5-dichloro-phenyl)-N-methyl-N-(2-pyrrolidin-1-yl-cyclohexyl)-acetamide
TypeSmall organic molecule
Emp. Form.C19H27Cl2N3O
Mol. Mass.384.343
SMILESCN(C1CCCC[C@@H]1N1CCCC1)C(=O)Cc1cc(Cl)c(Cl)cc1N