Reaction Details
TargetAdenosine receptor A1
LigandBDBM10847
Substrate/Competitorn/a
Meas. Tech.ChEBML_29453
Ki 700±n/a nM
Citation Peet, NPLentz, NLMeng, ECDudley, MWOgden, AMDemeter, DAWeintraub, HJBey, P A novel synthesis of xanthines: support for a new binding mode for xanthines with respect to adenosine at adenosine receptors. J Med Chem33:3127-30 (1991) Adenosine receptor A1
Name:Adenosine receptor A1
Type:Protein
Mol. Mass.:36704.13
Organism:Rattus norvegicus (rat)
Description:n/a
Residue:326
BDBM10847
NameBDBM10847
Synonyms:1,3-dimethyl-2,3,6,7-tetrahydro-1H-purine-2,6-dione Afonilum Aminophylline Cardophyllin Theophy-lline Theophylline (1,3-dimethylxanthine)
TypeSmall organic molecule
Emp. Form.C7H8N4O2
Mol. Mass.180.164
SMILESCn1c2nc[nH]c2c(=O)n(C)c1=O