Reaction Details
TargetPlatelet-activating factor receptor
LigandBDBM50014008
Substrate/Competitorn/a
Meas. Tech.ChEBML_155157
Ki 1045±n/a nM
Citation Sunkel, CEde Casa-Juana, MFSantos, LGómez, MMVillarroya, MGonzález-Morales, MAPriego, JGOrtega, MP 4-Alkyl-1,4-dihydropyridines derivatives as specific PAF-acether antagonists. J Med Chem33:3205-10 (1991) Platelet-activating factor receptor
Name:Platelet-activating factor receptor
Type:Protein
Mol. Mass.:39005.63
Organism:Cavia porcellus
Description:n/a
Residue:342
BDBM50014008
NameBDBM50014008
Synonyms:2,4,6-Trimethyl-1,4-dihydro-pyridine-3,5-dicarboxylic acid 3-ethyl ester 5-(2-methylsulfanyl-ethyl) ester | CHEMBL108086
TypeSmall organic molecule
Emp. Form.C15H23NO4S
Mol. Mass.313.412
SMILESCCOC(=O)C1C(C)C(C(=O)OCCSC)=C(C)N=C1C