Reaction Details
TargetCholecystokinin receptor type A
LigandBDBM81962
Substrate/Competitorn/a
Meas. Tech.ChEBML_49713
IC50 2±n/a nM
Citation Freidinger, RMWhitter, WLGould, NPHolloway, MKChang, RSLotti, VJ Novel glutamic acid derived cholecystokinin receptor ligands. J Med Chem33:591-5 (1990) Cholecystokinin receptor type A
Name:Cholecystokinin receptor type A
Type:n/a
Mol. Mass.:48229.77
Organism:Cavia porcellus
Description:n/a
Residue:430
BDBM81962
NameBDBM81962
Synonyms:S-L-365,260
Typen/a
Emp. Form.C24H22N4O2
Mol. Mass.398.4571
SMILESCN1c2ccccc2C(=N[C@@H](NC(=O)Nc2cccc(C)c2)C1=O)c1ccccc1