Reaction Details
TargetThromboxane-A synthase
LigandBDBM50014907
Substrate/Competitorn/a
Meas. Tech.ChEBML_210101
IC50 1100±n/a nM
Citation Archibald, JLBradley, GOpalko, AWard, TJWhite, JCEnnis, CShepperson, NB Design of an antithrombotic-antihypertensive agent (Wy 27569). Synthesis and evaluation of a series of 2-heteroaryl-substituted dihydropyridines. J Med Chem33:646-52 (1990) Thromboxane-A synthase
Name:Thromboxane-A synthase
Type:Enzyme
Mol. Mass.:60524.67
Organism:Homo sapiens (Human)
Description:P24557
Residue:533
BDBM50014907
NameBDBM50014907
Synonyms:4-(2-Difluoromethoxy-phenyl)-2-imidazol-1-ylmethyl-6-methyl-1,4-dihydro-pyridine-3,5-dicarboxylic acid 3-ethyl ester 5-methyl ester | CHEMBL347224
TypeSmall organic molecule
Emp. Form.C22H23F2N3O5
Mol. Mass.447.4319
SMILESCCOC(=O)C1=C(Cn2ccnc2)N=C(C)C(C1c1ccccc1OC(F)F)C(=O)OC