Reaction Details
TargetRibonucleoside-diphosphate reductase large subunit
LigandBDBM50013381
Substrate/Competitorn/a
Meas. Tech.ChEBML_195110
IC50 36000±n/a nM
Citation Gaudreau, PParadis, HLangelier, YBrazeau, P Synthesis and inhibitory potency of peptides corresponding to the subunit 2 C-terminal region of herpes virus ribonucleotide reductases. J Med Chem33:723-30 (1990) Ribonucleoside-diphosphate reductase large subunit
Name:Ribonucleoside-diphosphate reductase large subunit
Type:PROTEIN
Mol. Mass.:124049.68
Organism:Human herpesvirus 1 (strain 17) (HHV-1) (Human herpes simplex virus1)
Description:ChEMBL_195109
Residue:1137
BDBM50013381
NameBDBM50013381
Synonyms:Ala-Gly-Ala-Val-Val-Asn-Asp-Leu H-Ala-Gly-Ala-Val-Val-Asn-Asp-Leu-OH
TypeSmall organic molecule
Emp. Form.C32H55N9O12
Mol. Mass.757.8322
SMILESCC(C)C[C@H](NC(=O)[C@H](CC(O)=O)NC(=O)[C@H](CC(N)=O)NC(=O)[C@@H](NC(=O)[C@@H](NC(=O)[C@H](C)NC(=O)CNC(=O)[C@H](C)N)C(C)C)C(C)C)C(O)=O