Reaction Details
TargetRibonucleoside-diphosphate reductase large subunit
LigandBDBM50013383
Substrate/Competitorn/a
Meas. Tech.ChEBML_195110
IC50 44000±n/a nM
Citation Gaudreau, PParadis, HLangelier, YBrazeau, P Synthesis and inhibitory potency of peptides corresponding to the subunit 2 C-terminal region of herpes virus ribonucleotide reductases. J Med Chem33:723-30 (1990) Ribonucleoside-diphosphate reductase large subunit
Name:Ribonucleoside-diphosphate reductase large subunit
Type:PROTEIN
Mol. Mass.:124049.68
Organism:Human herpesvirus 1 (strain 17) (HHV-1) (Human herpes simplex virus1)
Description:ChEMBL_195109
Residue:1137
BDBM50013383
NameBDBM50013383
Synonyms:CHEMBL350585 | Tyr-C8-Val-Val-Asn-Asp-Leu
TypeSmall organic molecule
Emp. Form.C41H67N7O12
Mol. Mass.850.0104
SMILESCC(C)C[C@H](NC(=O)[C@H](CC(O)=O)NC(=O)[C@H](CC(N)=O)NC(=O)[C@@H](NC(=O)[C@@H](NCCCCCCCCOC(=O)[C@@H](N)Cc1ccc(O)cc1)C(C)C)C(C)C)C(O)=O