Reaction Details
TargetRibonucleoside-diphosphate reductase large subunit
LigandBDBM50013347
Substrate/Competitorn/a
Meas. Tech.ChEMBL_195109 (CHEMBL879071)
IC50 44000±n/a nM
Citation Gaudreau, PParadis, HLangelier, YBrazeau, P Synthesis and inhibitory potency of peptides corresponding to the subunit 2 C-terminal region of herpes virus ribonucleotide reductases. J Med Chem33:723-30 (1990) Ribonucleoside-diphosphate reductase large subunit
Name:Ribonucleoside-diphosphate reductase large subunit
Type:PROTEIN
Mol. Mass.:124049.68
Organism:Human herpesvirus 1 (strain 17) (HHV-1) (Human herpes simplex virus1)
Description:ChEMBL_195109
Residue:1137
BDBM50013347
NameBDBM50013347
Synonyms:CHEMBL387456 | H2N-C8-Tyr-Ala-Gly-Ala-Val-Val-Asn-Asp-Leu
TypeSmall organic molecule
Emp. Form.C49H81N11O14
Mol. Mass.1048.2327
SMILESCC(C)C[C@H](NC(=O)[C@H](CC(O)=O)NC(=O)[C@H](CC(N)=O)NC(=O)[C@@H](NC(=O)[C@@H](NC(=O)[C@H](C)NC(=O)CNC(=O)[C@H](C)NC(=O)[C@H](Cc1ccc(O)cc1)NCCCCCCCCN)C(C)C)C(C)C)C(O)=O