Reaction Details
TargetMu-type opioid receptor
LigandBDBM50013386
Substrate/Competitorn/a
Meas. Tech.ChEBML_146690
IC50 1.8±n/a nM
Citation Olsen, LDKlein, PNelson, WLYao, YHSimon, EJ Conjugate addition ligands of opioid antagonists. Methacrylate esters and ethers of 6 alpha- and 6 beta-naltrexol. J Med Chem33:737-41 (1990) Mu-type opioid receptor
Name:Mu-type opioid receptor
Type:Enzyme Catalytic Domain
Mol. Mass.:45038.37
Organism:CALF
Description:OPIATE Mu 2 0 CALF::P79350
Residue:401
BDBM50013386
NameBDBM50013386
Synonyms:4,5alpha-Epoxy-3,6alpha, 14-trihydroxy-6beta-(2-carboxyallyl)-17-(cyclopropylmethyl) morphinnan gama-lactone 4-cyclopropylmethyl-10,17-dihydroxy-12-oxa-4-azapentacyclo[9.6.1.01,13.05,17.07,18]octadeca-7,9,11(18)-trien-14-yl lactone | Naltrexone analogue
TypeSmall organic molecule
Emp. Form.C24H27NO5
Mol. Mass.409.4749
SMILESOc1ccc2CC3N(CC4CC4)CC[C@@]45C(Oc1c24)C1(CC(=C)C(=O)O1)CCC35O