Reaction Details
TargetVoltage-dependent L-type calcium channel subunit alpha-1C
LigandBDBM50015432
Substrate/Competitorn/a
Meas. Tech.ChEBML_42758
Kd 23±n/a nM
Citation Atwal, KSRovnyak, GCSchwartz, JMoreland, SHedberg, AGougoutas, JZMalley, MFFloyd, DM Dihydropyrimidine calcium channel blockers: 2-heterosubstituted 4-aryl-1,4-dihydro-6-methyl-5-pyrimidinecarboxylic acid esters as potent mimics of dihydropyridines. J Med Chem33:1510-5 (1990) Voltage-dependent L-type calcium channel subunit alpha-1C
Name:Voltage-dependent L-type calcium channel subunit alpha-1C
Type:Enzyme Catalytic Domain
Mol. Mass.:248979.79
Organism:Homo sapiens (Human)
Description:Calcium channel (Type L) 0 HUMAN::Q13936
Residue:2221
BDBM50015432
NameBDBM50015432
Synonyms:6-Methyl-2-methylsulfanyl-4-(3-nitro-phenyl)-1,4-dihydro-pyrimidine-5-carboxylic acid ethyl ester | CHEMBL39925
TypeSmall organic molecule
Emp. Form.C15H17N3O4S
Mol. Mass.335.378
SMILESCCOC(=O)C1C(N=C(SC)N=C1C)c1cccc(c1)[N+]([O-])=O