Reaction Details
TargetAngiotensin-converting enzyme 2
LigandBDBM50367254
Substrate/Competitorn/a
Meas. Tech.ChEMBL_36893 (CHEMBL648683)
IC50 1.2±n/a nM
Citation Mencel, JJRegan, JRBarton, JMenard, PRBruno, JGCalvo, RRKornberg, BESchwab, ANeiss, ESSuh, JT Angiotensin converting enzyme inhibitors. 10. Aryl sulfonamide substituted N-[1-carboxy-3-phenylpropyl]-L-alanyl-L-proline derivatives as novel antihypertensives. J Med Chem33:1606-15 (1990) Angiotensin-converting enzyme 2
Name:Angiotensin-converting enzyme 2
Type:n/a
Mol. Mass.:n/a
Description:ASSAY_ID of EBI is 35589
Components:This complex has 2 components.
Component 1
Name:Angiotensin-converting enzyme
Synonyms:ACE Angiotensin converting enzyme (ACE) Angiotensin-converting enzyme, soluble form CD_antigen=CD143 DCP1 Kininase II
Type:Enzyme
Mol. Mass.:149709.01
Organism:Homo sapiens (Human)
Description:n/a
Residue:1306
Component 2
Name:Angiotensin-converting enzyme 2
Synonyms:ACE-related carboxypeptidase ACE2_HUMAN Angiotensin-converting enzyme homolog Metalloprotease MPROT15
Type:Enzyme
Mol. Mass.:92448.86
Organism:Homo sapiens (Human)
Description:n/a
Residue:805
BDBM50367254
NameBDBM50367254
Synonyms:ENALAPRILAT
TypeSmall organic molecule
Emp. Form.C18H24N2O5
Mol. Mass.348.3936
SMILESC[C@H](N[C@@H](CCc1ccccc1)C(O)=O)C(=O)N1CCC[C@H]1C(O)=O