Reaction Details
TargetAngiotensin-converting enzyme 2
LigandBDBM50017129
Substrate/Competitorn/a
Meas. Tech.ChEMBL_36893 (CHEMBL648683)
IC50 1200±n/a nM
Citation Mencel, JJRegan, JRBarton, JMenard, PRBruno, JGCalvo, RRKornberg, BESchwab, ANeiss, ESSuh, JT Angiotensin converting enzyme inhibitors. 10. Aryl sulfonamide substituted N-[1-carboxy-3-phenylpropyl]-L-alanyl-L-proline derivatives as novel antihypertensives. J Med Chem33:1606-15 (1990) Angiotensin-converting enzyme 2
Name:Angiotensin-converting enzyme 2
Type:n/a
Mol. Mass.:n/a
Description:ASSAY_ID of EBI is 35589
Components:This complex has 2 components.
Component 1
Name:Angiotensin-converting enzyme
Synonyms:ACE Angiotensin converting enzyme (ACE) Angiotensin-converting enzyme, soluble form CD_antigen=CD143 DCP1 Kininase II
Type:Enzyme
Mol. Mass.:149709.01
Organism:Homo sapiens (Human)
Description:n/a
Residue:1306
Component 2
Name:Angiotensin-converting enzyme 2
Synonyms:ACE-related carboxypeptidase ACE2_HUMAN Angiotensin-converting enzyme homolog Metalloprotease MPROT15
Type:Enzyme
Mol. Mass.:92448.86
Organism:Homo sapiens (Human)
Description:n/a
Residue:805
BDBM50017129
NameBDBM50017129
Synonyms:(S)-1-((S)-2-((R)-1-ethoxy-1-oxo-4-phenylbutan-2-ylamino)propanoyl)pyrrolidine-2-carboxylic acid (S)-1-{(S)-2-[1-((S)-Ethoxycarbonyl)-3-phenyl-propylamino]-propionyl}-pyrrolidine-2-carboxylic acid (SSS)1-[2-(1-Ethoxycarbonyl-3-phenyl-propylamino)-propionyl]-pyrrolidine-2-carboxylic acid 1-[2-(1-Ethoxycarbonyl-3-phenyl-propylamino)-propionyl]-pyrrolidine-2-carboxylic acid (Enalapril) 2-[2-(1-Carboxy-3-phenyl-propylamino)-propionyl]-1,2,3,4-tetrahydro-isoquinoline-3-carboxylic acid(enalapril) ENALAPRIL Lexxel Vaseretic | Vasotec
TypeSmall organic molecule
Emp. Form.C20H28N2O5
Mol. Mass.376.4467
SMILESCCOC(=O)[C@H](CCc1ccccc1)N[C@@H](C)C(=O)N1CCC[C@H]1C(O)=O