Reaction Details
TargetDelta-type opioid receptor
LigandBDBM50013620
Substrate/Competitorn/a
Meas. Tech.ChEBML_147154
Ki 11±n/a nM
Citation Portoghese, PSSultana, MTakemori, AE Design of peptidomimetic delta opioid receptor antagonists using the message-address concept. J Med Chem33:1714-20 (1990) Delta-type opioid receptor
Name:Delta-type opioid receptor
Type:G Protein-Coupled Receptor (GPCR)
Mol. Mass.:40382.98
Organism:Homo sapiens (Human)
Description:Competition binding assays were carried out using membrane preparations from transfected HN9.10 cells that constitutively expressed the delta opioid receptor.
Residue:372
BDBM50013620
NameBDBM50013620
Synonyms:2-[2-{2-[2-(2-Amino-3-phenyl-propionylamino)-3-mercapto-3-methyl-butyrylamino]-acetylamino}-3-(4-hydroxy-phenyl)-propionylamino]-3-mercapto-3-methyl-butyric acid (DPLPE) | CHEMBL2372782
TypeSmall organic molecule
Emp. Form.C30H41N5O7S2
Mol. Mass.647.806
SMILESCC(C)(S)[C@@H](NC(=O)[C@H](Cc1ccc(O)cc1)NC(=O)CNC(=O)[C@H](NC(=O)[C@@H](N)Cc1ccccc1)C(C)(C)S)C(O)=O