Reaction Details
TargetDelta-type opioid receptor
LigandBDBM50221416
Substrate/Competitorn/a
Meas. Tech.ChEMBL_146439 (CHEMBL757336)
Ki 0.700000±n/a nM
Citation Portoghese, PSSultana, MTakemori, AE Design of peptidomimetic delta opioid receptor antagonists using the message-address concept. J Med Chem33:1714-20 (1990) Delta-type opioid receptor
Name:Delta-type opioid receptor
Type:G Protein-Coupled Receptor (GPCR)
Mol. Mass.:40382.98
Organism:Homo sapiens (Human)
Description:Competition binding assays were carried out using membrane preparations from transfected HN9.10 cells that constitutively expressed the delta opioid receptor.
Residue:372
BDBM50221416
NameBDBM50221416
Synonyms:22-methyl-(2S,13R)-14-oxa-11,22-diazaheptacyclo[13.9.1.01,13.02,21.04,12.05,10.019,25]pentacosa-4(12),5(10),6,8,15(25),16,18-heptaene-2,16-diol(HCl0.5H2O) (Oxymorphindole, OMI) CHEMBL401093 | OXYMORPHINDOLE
TypeSmall organic molecule
Emp. Form.C23H22N2O3
Mol. Mass.374.4324
SMILESCN1CC[C@@]23[C@H]4Oc5c2c(C[C@@H]1[C@]3(O)Cc1c4[nH]c2ccccc12)ccc5O