Reaction Details
TargetKappa-type opioid receptor
LigandBDBM50006946
Substrate/Competitorn/a
Meas. Tech.ChEMBL_145224 (CHEMBL755521)
Ki>1000±n/a nM
Citation Portoghese, PSSultana, MTakemori, AE Design of peptidomimetic delta opioid receptor antagonists using the message-address concept. J Med Chem33:1714-20 (1990) Kappa-type opioid receptor
Name:Kappa-type opioid receptor
Type:G Protein-Coupled Receptor (GPCR)
Mol. Mass.:42744.99
Organism:Cavia porcellus (domestic guinea pig)
Description:P41144
Residue:380
BDBM50006946
NameBDBM50006946
Synonyms:2-[2-(2-{2-[2-Diallylamino-3-(4-hydroxy-phenyl)-propionylamino]-2-methyl-propionylamino}-2-methyl-propionylamino)-3-phenyl-propionylamino]-4-methyl-pentanoic acid ICI-174864
TypeSmall organic molecule
Emp. Form.C38H53N5O7
Mol. Mass.691.8567
SMILESCC(C)C[C@H](NC(=O)[C@H](Cc1ccccc1)NC(=O)C(C)(C)NC(=O)C(C)(C)NC(=O)[C@H](Cc1ccc(O)cc1)N(CC=C)CC=C)C(O)=O