Reaction Details
TargetKappa-type opioid receptor
LigandBDBM50013624
Substrate/Competitorn/a
Meas. Tech.ChEMBL_145224 (CHEMBL755521)
Ki 15±n/a nM
Citation Portoghese, PSSultana, MTakemori, AE Design of peptidomimetic delta opioid receptor antagonists using the message-address concept. J Med Chem33:1714-20 (1990) Kappa-type opioid receptor
Name:Kappa-type opioid receptor
Type:G Protein-Coupled Receptor (GPCR)
Mol. Mass.:42744.99
Organism:Cavia porcellus (domestic guinea pig)
Description:P41144
Residue:380
BDBM50013624
NameBDBM50013624
Synonyms:22-cyclopropylmethyl-7-fluoro-(2S,13R)-14-oxa-11,22-diazaheptacyclo[13.9.1.01,13.02,21.04,12.05,10.019,25]pentacosa-4(12),5(10),6,8,15(25),16,18-heptaene-2,16-diol(HCl.1.5H2O) | 22-cyclopropylmethyl-7-fluoro-14-oxa-11,22-diazaheptacyclo[13.9.1.01,13.02,21.04,12.05,10.019,25]pentacosa-4(12),5(10),6,8,15,17,19(25)-heptaene-2,16-diol
TypeSmall organic molecule
Emp. Form.C26H25FN2O3
Mol. Mass.432.4867
SMILESOc1ccc2CC3N(CC4CC4)CC[C@@]45[C@@H](Oc1c24)c1[nH]c2ccc(F)cc2c1C[C@@]35O