Reaction Details
TargetDelta-type opioid receptor
LigandBDBM50013621
Substrate/Competitorn/a
Meas. Tech.ChEMBL_147154 (CHEMBL758179)
Ki 1.1±n/a nM
Citation Portoghese, PSSultana, MTakemori, AE Design of peptidomimetic delta opioid receptor antagonists using the message-address concept. J Med Chem33:1714-20 (1990) Delta-type opioid receptor
Name:Delta-type opioid receptor
Type:G Protein-Coupled Receptor (GPCR)
Mol. Mass.:40382.98
Organism:Homo sapiens (Human)
Description:Competition binding assays were carried out using membrane preparations from transfected HN9.10 cells that constitutively expressed the delta opioid receptor.
Residue:372
BDBM50013621
NameBDBM50013621
Synonyms:22-allyl-(2S,13R)-14-oxa-11,22-diazaheptacyclo[13.9.1.01,13.02,21.04,12.05,10.019,25]pentacosa-4(12),5(10),6,8,15(25),16,18-heptaene-2,16-diol
TypeSmall organic molecule
Emp. Form.C25H24N2O3
Mol. Mass.400.4697
SMILESOc1ccc2CC3N(CC=C)CC[C@@]45[C@@H](Oc1c24)c1[nH]c2ccccc2c1C[C@@]35O