Reaction Details
TargetDelta-type opioid receptor
LigandBDBM50013627
Substrate/Competitorn/a
Meas. Tech.ChEBML_147154
Ki 0.600000±n/a nM
Citation Portoghese, PSSultana, MTakemori, AE Design of peptidomimetic delta opioid receptor antagonists using the message-address concept. J Med Chem33:1714-20 (1990) Delta-type opioid receptor
Name:Delta-type opioid receptor
Type:G Protein-Coupled Receptor (GPCR)
Mol. Mass.:40382.98
Organism:Homo sapiens (Human)
Description:Competition binding assays were carried out using membrane preparations from transfected HN9.10 cells that constitutively expressed the delta opioid receptor.
Residue:372
BDBM50013627
NameBDBM50013627
Synonyms:22-cyclopropylmethyl-11-phenyl-(2S,13R)-14-oxa-11,22-diazaheptacyclo[13.9.1.01,13.02,21.04,12.05,10.019,25]pentacosa-4(12),5(10),6,8,15(25),16,18-heptaene-2,16-diol(HCl)
TypeSmall organic molecule
Emp. Form.C32H30N2O3
Mol. Mass.490.5922
SMILESOc1ccc2CC3N(CC4CC4)CC[C@@]45[C@@H](Oc1c24)c1c(C[C@@]35O)c2ccccc2n1-c1ccccc1