Reaction Details
TargetAdenosine receptor A2a/A2b
LigandBDBM50407975
Substrate/Competitorn/a
Meas. Tech.ChEMBL_30721 (CHEMBL646487)
Ki 71±n/a nM
Citation Hutchison, AJWilliams, Mde Jesus, RYokoyama, ROei, HHGhai, GRWebb, RLZoganas, HCStone, GAJarvis, MF 2-(Arylalkylamino)adenosin-5'-uronamides: a new class of highly selective adenosine A2 receptor ligands. J Med Chem33:1919-24 (1990) Adenosine receptor A2a/A2b
Name:Adenosine receptor A2a/A2b
Synonyms:Adenosine A2 receptor
Type:n/a
Mol. Mass.:n/a
Description:ASSAY_ID of ChEMBL is 30560
Components:This complex has 2 components.
Component 1
Name:Adenosine receptor A2b
Type:PROTEIN
Mol. Mass.:36378.84
Organism:Rattus norvegicus
Description:ChEMBL_32934
Residue:332
Component 2
Name:Adenosine receptor A2a
Synonyms:AA2AR_RAT Adenosine A2 receptor Adenosine Receptors A2a (A2a) Adenosine receptors A2a Rat striatal adenosine A2a receptor
Type:G Protein-Coupled Receptor (GPCR)
Mol. Mass.:45015.65
Organism:Rattus norvegicus (rat)
Description:Rat A2A receptors expressed in CHO cells.
Residue:410
BDBM50407975
NameBDBM50407975
Synonyms:CHEMBL519809
TypeSmall organic molecule
Emp. Form.C11H14N6O4
Mol. Mass.294.2667
SMILESCNC(=O)[C@H]1O[C@H]([C@H](O)[C@@H]1O)n1cnc2c(N)ncnc12