Reaction Details
TargetPolyunsaturated fatty acid 5-lipoxygenase
LigandBDBM50331888
Substrate/Competitorn/a
Meas. Tech.ChEBML_3925
IC50 9000±n/a nM
Citation Mylari, BLCarty, TJMoore, PFZembrowski, WJ 1,2-Dihydro-1-oxopyrrolo[3,2,1-kl]phenothiazine-2-carboxamides and congeners, dual cyclooxygenase/5-lipoxygenase inhibitors with antiinflammatory activity. J Med Chem33:2019-24 (1990) Polyunsaturated fatty acid 5-lipoxygenase
Name:Polyunsaturated fatty acid 5-lipoxygenase
Type:PROTEIN
Mol. Mass.:78082.31
Organism:Rattus norvegicus
Description:ChEMBL_1432947
Residue:673
BDBM50331888
NameBDBM50331888
Synonyms:5-Chloro-2-oxo-3-(thiophene-2-carbonyl)-2,3-dihydro-indole-1-carboxylic acid amide CHEMBL1097558 | Tenidap
TypeSmall organic molecule
Emp. Form.C14H9ClN2O3S
Mol. Mass.320.751
SMILESNC(=O)n1c(O)c(C(=O)c2cccs2)c2cc(Cl)ccc12