Reaction Details
TargetMuscarinic acetylcholine receptor M3
LigandBDBM50403547
Substrate/Competitorn/a
Meas. Tech.ChEBML_138851
Kd 0.630000±n/a nM
Citation Cereda, EEzhaya, AGil Quintero, MBellora, EDubini, EMicheletti, RSchiavone, ABrambilla, ASchiavi, GBDonetti, A Synthesis and biological evaluation of new antimuscarinic compounds with amidine basic centers. A useful bioisosteric replacement of classical cationic heads. J Med Chem33:2108-13 (1990) Muscarinic acetylcholine receptor M3
Name:Muscarinic acetylcholine receptor M3
Type:Enzyme Catalytic Domain
Mol. Mass.:66086.66
Organism:RAT
Description:Cholinergic, muscarinic M3 CHRM3 RAT::P08483
Residue:589
BDBM50403547
NameBDBM50403547
Synonyms:ATROPEN | ATROPINE
TypeSmall organic molecule
Emp. Form.C17H23NO3
Mol. Mass.289.3694
SMILESCN1[C@H]2CC[C@@H]1C[C@@H](C2)OC(=O)C(CO)c1ccccc1