Reaction Details
TargetD(1A) dopamine receptor
LigandBDBM50010707
Substrate/Competitorn/a
Meas. Tech.ChEBML_58969
Ki 0.400000±n/a nM
Citation Pettersson, ILiljefors, TBøgesø, K Conformational analysis and structure-activity relationships of selective dopamine D-1 receptor agonists and antagonists of the benzazepine series. J Med Chem33:2197-204 (1990) D(1A) dopamine receptor
Name:D(1A) dopamine receptor
Type:Enzyme
Mol. Mass.:49303.43
Organism:Homo sapiens (Human)
Description:P21728
Residue:446
BDBM50010707
NameBDBM50010707
Synonyms:8-Chloro-3-methyl-5-m-tolyl-2,3,4,5-tetrahydro-1H-benzo[d]azepin-7-ol | CHEMBL304535
TypeSmall organic molecule
Emp. Form.C18H20ClNO
Mol. Mass.301.811
SMILESCN1CCc2cc(Cl)c(O)cc2[C@H](C1)c1cccc(C)c1