Reaction Details
TargetD(1A) dopamine receptor
LigandBDBM82247
Substrate/Competitorn/a
Meas. Tech.ChEBML_58990
Ki 0.400000±n/a nM
Citation Pettersson, ILiljefors, TBøgesø, K Conformational analysis and structure-activity relationships of selective dopamine D-1 receptor agonists and antagonists of the benzazepine series. J Med Chem33:2197-204 (1990) D(1A) dopamine receptor
Name:D(1A) dopamine receptor
Type:Enzyme
Mol. Mass.:49613.93
Organism:Mus musculus (Mouse)
Description:Q61616
Residue:446
BDBM82247
NameBDBM82247
Synonyms:8-Chloro-3-methyl-5-phenyl-2,3,4,5-tetrahydro-1H-benzo[d]azepin-7-ol(SCH 23390) CHEMBL2158641 SCH 23388 SCH 23390 (R-enantiomer) | SCH 23390,R(+)
TypeSmall organic molecule
Emp. Form.C17H18ClNO
Mol. Mass.287.784
SMILESCN1CCc2cc(Cl)c(O)cc2[C@H](C1)c1ccccc1