Reaction Details
TargetDual specificity calcium/calmodulin-dependent 3',5'-cyclic nucleotide phosphodiesterase 1B/Dual specificity calcium/calmodulin-dependent 3',5'-cyclic nucleotide phosphodiesterase 1C/Phosphodiesterase
LigandBDBM50015769
Substrate/Competitorn/a
Meas. Tech.ChEMBL_176826 (CHEMBL780519)
IC50>10000±n/a nM
Citation Sarges, RHoward, HRBrowne, RGLebel, LASeymour, PAKoe, BK 4-Amino[1,2,4]triazolo[4,3-a]quinoxalines. A novel class of potent adenosine receptor antagonists and potential rapid-onset antidepressants. J Med Chem33:2240-54 (1990) Dual specificity calcium/calmodulin-dependent 3',5'-cyclic nucleotide phosphodiesterase 1B/Dual specificity calcium/calmodulin-dependent 3',5'-cyclic nucleotide phosphodiesterase 1C/Phosphodiesterase
Name:Dual specificity calcium/calmodulin-dependent 3',5'-cyclic nucleotide phosphodiesterase 1B/Dual specificity calcium/calmodulin-dependent 3',5'-cyclic nucleotide phosphodiesterase 1C/Phosphodiesterase
Type:n/a
Mol. Mass.:n/a
Description:ASSAY_ID of ChEMBL is 154419
Components:This complex has 3 components.
Component 1
Name:Dual specificity calcium/calmodulin-dependent 3',5'-cyclic nucleotide phosphodiesterase 1C
Synonyms:Calcium/calmodulin-dependent 3',5'-cyclic nucleotide phosphodiesterase 1C Dual specificity Calcium/calmodulin-dependent 3',5'-cyclic nucleotide phosphodiesterase 1C Pde1c | Pde1c2
Type:PROTEIN
Mol. Mass.:86691.70
Organism:Rattus norvegicus
Description:ChEMBL_105015
Residue:768
Component 2
Name:Phosphodiesterase
Synonyms:Pde1a | Phosphodiesterase 1A
Type:PROTEIN
Mol. Mass.:61851.57
Organism:Rattus norvegicus
Description:ChEMBL_105015
Residue:542
Component 3
Name:Dual specificity calcium/calmodulin-dependent 3',5'-cyclic nucleotide phosphodiesterase 1B
Synonyms:63 kDa Cam-PDE PDE1B_RAT Pde1b1 | Phosphodiesterase 1
Type:PROTEIN
Mol. Mass.:61248.78
Organism:Rattus norvegicus
Description:ChEMBL_105015
Residue:535
BDBM50015769
NameBDBM50015769
Synonyms:8-Fluoro-[1,2,4]triazolo[4,3-a]quinoxalin-4-ylamine | CHEMBL73039
TypeSmall organic molecule
Emp. Form.C9H6FN5
Mol. Mass.203.1758
SMILESNc1nc2ccc(F)cc2n2cnnc12