Reaction Details
TargetMu-type opioid receptor
LigandBDBM50013761
Substrate/Competitorn/a
Meas. Tech.ChEBML_146692
IC50 0.320000±n/a nM
Citation Klein, PNelson, WLYao, YHSimon, EJ Electrophilic alpha-methylene-gamma-lactone and isothiocyanate opioid ligands related to etorphine. J Med Chem33:2286-96 (1990) Mu-type opioid receptor
Name:Mu-type opioid receptor
Type:Enzyme Catalytic Domain
Mol. Mass.:45038.37
Organism:CALF
Description:OPIATE Mu 2 0 CALF::P79350
Residue:401
BDBM50013761
NameBDBM50013761
Synonyms:(R)-1-(3-cyclopropylmethyl-11,15-dimethoxy-13-oxa-3-azahexacyclo[13.2.2.12,8.01,6.06,14.07,12]icosa-7,9,11,18-tetraen-16-yl)ethyl isothiocyanate | CHEMBL3038194
TypeSmall organic molecule
Emp. Form.C26H30N2O3S
Mol. Mass.450.593
SMILES[H][C@@]12Oc3c4c(C[C@@]5([H])N(CC6CC6)CC[C@@]14[C@]51CC([C@H](C)N=C=S)[C@]2(OC)C=C1)ccc3O