Reaction Details
TargetVasopressin V2 receptor
LigandBDBM50205990
Substrate/Competitorn/a
Meas. Tech.ChEMBL_215037 (CHEMBL881616)
Ki 61±n/a nM
Citation Bock, MGDiPardo, RMWilliams, PDPettibone, DJClineschmidt, BVBall, RGVeber, DFFreidinger, RM Receptor ligands which bind the oxytocin receptor with selectivity and high affinity. Chemical modification of a Streptomyces silvensis derived cyclic hexapeptide. J Med Chem33:2321-3 (1990) Vasopressin V2 receptor
Name:Vasopressin V2 receptor
Type:G-protein coupled receptor
Mol. Mass.:40761.85
Organism:Rattus norvegicus (Rat)
Description:n/a
Residue:371
BDBM50205990
NameBDBM50205990
Synonyms:CHEMBL395429 | OXYTOCIN
TypeSmall organic molecule
Emp. Form.C43H66N12O12S2
Mol. Mass.1007.187
SMILESCC[C@H](C)[C@@H]1NC(=O)[C@H](Cc2ccc(O)cc2)NC(=O)[C@@H](N)CSSC[C@H](NC(=O)[C@H](CC(N)=O)NC(=O)[C@H](CCC(N)=O)NC1=O)C(=O)N1CCC[C@H]1C(=O)N[C@@H](CC(C)C)C(=O)NCC(N)=O