Reaction Details
TargetSigma non-opioid intracellular receptor 1
LigandBDBM50010800
Substrate/Competitorn/a
Meas. Tech.ChEBML_201720
IC50 37.0±n/a nM
Citation Scherz, MWFialeix, MFischer, JBReddy, NLServer, ACSonders, MSTester, BCWeber, EWong, STKeana, JF Synthesis and structure-activity relationships of N,N'-di-o-tolylguanidine analogues, high-affinity ligands for the haloperidol-sensitive sigma receptor. J Med Chem33:2421-9 (1990) Sigma non-opioid intracellular receptor 1
Name:Sigma non-opioid intracellular receptor 1
Type:Enzyme Catalytic Domain
Mol. Mass.:25124.85
Organism:Homo sapiens (Human)
Description:Q99720
Residue:223
BDBM50010800
NameBDBM50010800
Synonyms:CHEMBL79436 | N,N'-Bis-(4-bromo-2-methyl-phenyl)-guanidine
TypeSmall organic molecule
Emp. Form.C15H15Br2N3
Mol. Mass.397.108
SMILESCc1cc(Br)ccc1NC(N)=Nc1ccc(Br)cc1C