Reaction Details
TargetSigma non-opioid intracellular receptor 1
LigandBDBM50010742
Substrate/Competitorn/a
Meas. Tech.ChEMBL_201266 (CHEMBL804883)
IC50 6±n/a nM
Citation Scherz, MWFialeix, MFischer, JBReddy, NLServer, ACSonders, MSTester, BCWeber, EWong, STKeana, JF Synthesis and structure-activity relationships of N,N'-di-o-tolylguanidine analogues, high-affinity ligands for the haloperidol-sensitive sigma receptor. J Med Chem33:2421-9 (1990) Sigma non-opioid intracellular receptor 1
Name:Sigma non-opioid intracellular receptor 1
Type:Enzyme Catalytic Domain
Mol. Mass.:25124.85
Organism:Homo sapiens (Human)
Description:Q99720
Residue:223
BDBM50010742
NameBDBM50010742
Synonyms:CHEMBL81773 | N-Bicyclo[2.2.1]hept-2-yl-N'-o-tolyl-guanidine
TypeSmall organic molecule
Emp. Form.C15H21N3
Mol. Mass.243.3473
SMILESCc1ccccc1NC(N)=NC1CC2CCC1C2