Reaction Details
TargetSigma non-opioid intracellular receptor 1
LigandBDBM50010747
Substrate/Competitorn/a
Meas. Tech.ChEMBL_201265 (CHEMBL873129)
IC50 30±n/a nM
Citation Scherz, MWFialeix, MFischer, JBReddy, NLServer, ACSonders, MSTester, BCWeber, EWong, STKeana, JF Synthesis and structure-activity relationships of N,N'-di-o-tolylguanidine analogues, high-affinity ligands for the haloperidol-sensitive sigma receptor. J Med Chem33:2421-9 (1990) Sigma non-opioid intracellular receptor 1
Name:Sigma non-opioid intracellular receptor 1
Type:Enzyme Catalytic Domain
Mol. Mass.:25124.85
Organism:Homo sapiens (Human)
Description:Q99720
Residue:223
BDBM50010747
NameBDBM50010747
Synonyms:CHEMBL543201 N,N'-Bis-(3-ethyl-phenyl)-guanidine
TypeSmall organic molecule
Emp. Form.C17H21N3
Mol. Mass.267.3687
SMILESCCc1cccc(NC(N)=Nc2cccc(CC)c2)c1