Reaction Details
TargetSigma non-opioid intracellular receptor 1
LigandBDBM50010759
Substrate/Competitorn/a
Meas. Tech.ChEMBL_201265 (CHEMBL873129)
IC50 5±n/a nM
Citation Scherz, MWFialeix, MFischer, JBReddy, NLServer, ACSonders, MSTester, BCWeber, EWong, STKeana, JF Synthesis and structure-activity relationships of N,N'-di-o-tolylguanidine analogues, high-affinity ligands for the haloperidol-sensitive sigma receptor. J Med Chem33:2421-9 (1990) Sigma non-opioid intracellular receptor 1
Name:Sigma non-opioid intracellular receptor 1
Type:Enzyme Catalytic Domain
Mol. Mass.:25124.85
Organism:Homo sapiens (Human)
Description:Q99720
Residue:223
BDBM50010759
NameBDBM50010759
Synonyms:CHEMBL553896 | N-Adamantan-1-yl-N'-(2-iodo-phenyl)-guanidine; hydrochloride
TypeSmall organic molecule
Emp. Form.C17H22IN3
Mol. Mass.395.2811
SMILESNC(NC12CC3CC(CC(C3)C1)C2)=Nc1ccccc1I