Reaction Details
TargetSigma non-opioid intracellular receptor 1
LigandBDBM50010774
Substrate/Competitorn/a
Meas. Tech.ChEMBL_201265 (CHEMBL873129)
IC50 33±n/a nM
Citation Scherz, MWFialeix, MFischer, JBReddy, NLServer, ACSonders, MSTester, BCWeber, EWong, STKeana, JF Synthesis and structure-activity relationships of N,N'-di-o-tolylguanidine analogues, high-affinity ligands for the haloperidol-sensitive sigma receptor. J Med Chem33:2421-9 (1990) Sigma non-opioid intracellular receptor 1
Name:Sigma non-opioid intracellular receptor 1
Type:Enzyme Catalytic Domain
Mol. Mass.:25124.85
Organism:Homo sapiens (Human)
Description:Q99720
Residue:223
BDBM50010774
NameBDBM50010774
Synonyms:CHEMBL539782 N,N'-Dibenzyl-guanidine; hydrobromide
TypeSmall organic molecule
Emp. Form.C15H17N3
Mol. Mass.239.3156
SMILESN=C(NCc1ccccc1)NCc1ccccc1