Reaction Details
TargetReverse transcriptase/RNaseH
LigandBDBM50007907
Substrate/Competitorn/a
Meas. Tech.ChEBML_195055
IC50 4600±n/a nM
Citation Jie, LVan Aerschot, ABalzarini, JJanssen, GBusson, RHoogmartens, JDe Clercq, EHerdewijn, P 5'-O-phosphonomethyl-2',3'-dideoxynucleosides: synthesis and anti-HIV activity. J Med Chem33:2481-7 (1990) Reverse transcriptase/RNaseH
Name:Reverse transcriptase/RNaseH
Type:PROTEIN
Mol. Mass.:65229.15
Organism:Human immunodeficiency virus 1
Description:ChEMBL_1473730
Residue:566
BDBM50007907
NameBDBM50007907
Synonyms:CHEMBL3350647 | alpha,beta-methylene AzddTPP
TypeSmall organic molecule
Emp. Form.C12H20N5O13P3
Mol. Mass.535.2342
SMILESCC1C(=O)NC(=O)N([C@H]2C[C@H](N=[N+]=[N-])[C@@H](COCP(O)(=O)OP(O)(=O)OP(O)(O)=O)O2)C1=C