Reaction Details
TargetGastrin/cholecystokinin type B receptor
LigandBDBM50452998
Substrate/Competitorn/a
Meas. Tech.ChEMBL_48263 (CHEMBL663168)
IC50 0.800000±n/a nM
Citation Horwell, DCHughes, JHunter, JCPritchard, MCRichardson, RSRoberts, EWoodruff, GN Rationally designed"dipeptoid" analogues of CCK. alpha-Methyltryptophan derivatives as highly selective and orally active gastrin and CCK-B antagonists with potent anxiolytic properties. J Med Chem34:404-14 (1991) Gastrin/cholecystokinin type B receptor
Name:Gastrin/cholecystokinin type B receptor
Type:Enzyme Catalytic Domain
Mol. Mass.:49196.59
Organism:MOUSE
Description:Cholecystokinin A CCKBR MOUSE::P56481
Residue:453
BDBM50452998
NameBDBM50452998
Synonyms:CHEMBL2112693
TypeSmall organic molecule
Emp. Form.C34H42N4O7
Mol. Mass.618.7199
SMILESO.[H][C@@](CNC(=O)[C@@](C)(Cc1c[nH]c2ccccc12)NC(=O)OC1[C@@]2([H])C[C@]3([H])C[C@@]([H])(C[C@@]1([H])C3)C2)(NC(=O)CC(O)=O)c1ccccc1