Reaction Details
TargetGastrin/cholecystokinin type B receptor
LigandBDBM50024321
Substrate/Competitorn/a
Meas. Tech.ChEBML_48263
IC50 0.800000±n/a nM
Citation Horwell, DCHughes, JHunter, JCPritchard, MCRichardson, RSRoberts, EWoodruff, GN Rationally designed"dipeptoid" analogues of CCK. alpha-Methyltryptophan derivatives as highly selective and orally active gastrin and CCK-B antagonists with potent anxiolytic properties. J Med Chem34:404-14 (1991) Gastrin/cholecystokinin type B receptor
Name:Gastrin/cholecystokinin type B receptor
Type:Enzyme Catalytic Domain
Mol. Mass.:49196.59
Organism:MOUSE
Description:Cholecystokinin A CCKBR MOUSE::P56481
Residue:453
BDBM50024321
NameBDBM50024321
Synonyms:3-{2-[2-(3-tert-Butoxycarbonylamino-propionylamino)-3-(1H-indol-3-yl)-propionylamino]-4-methylsulfanyl-butyrylamino}-N-(1-carbamoyl-2-phenyl-ethyl)-succinamic acid CHEMBL1328 PENTAGASTRIN | Peptavlon
TypeSmall organic molecule
Emp. Form.C37H49N7O9S
Mol. Mass.767.891
SMILESCSCC[C@H](NC(=O)[C@H](Cc1c[nH]c2ccccc12)NC(=O)CCNC(=O)OC(C)(C)C)C(=O)N[C@@H](CC(O)=O)C(=O)N[C@@H](Cc1ccccc1)C(N)=O