Reaction Details
Target3-hydroxy-3-methylglutaryl-coenzyme A reductase
LigandBDBM50007295
Substrate/Competitorn/a
Meas. Tech.ChEMBL_80663 (CHEMBL691948)
IC50 1±n/a nM
Citation Jendralla, HGranzer, Evon Kerekjarto, BKrause, RSchacht, UBaader, EBartmann, WBeck, GBergmann, AKesseler, K Synthesis and biological activity of new HMG-CoA reductase inhibitors. 3. Lactones of 6-phenoxy-3,5-dihydroxyhexanoic acids. J Med Chem34:2962-83 (1991) 3-hydroxy-3-methylglutaryl-coenzyme A reductase
Name:3-hydroxy-3-methylglutaryl-coenzyme A reductase
Type:Enzyme
Mol. Mass.:96689.85
Organism:Rattus norvegicus (rat)
Description:Isolated rat liver microsomes were used as enzyme source.
Residue:887
BDBM50007295
NameBDBM50007295
Synonyms:CHEMBL2367823 | Sodium; 7-[4-(4-fluoro-phenyl)-2,6-diisopropyl-pyridin-3-yl]-3,5-dihydroxy-hept-6-enoate
TypeSmall organic molecule
Emp. Form.C25H31FNNaO4
Mol. Mass.451.5061
SMILES[Na+].CC(C)c1nc(cc(-c2ccc(F)cc2)c1\C=C\[C@@H](O)C[C@@H](O)CC([O-])=O)C(C)(C)C