Reaction Details
TargetMuscarinic acetylcholine receptor M1
LigandBDBM50010099
Substrate/Competitorn/a
Meas. Tech.ChEBML_139068
Ki 2.1±n/a nM
Citation Hudkins, RLDeHaven-Hudkins, DLStubbins, JF Muscarinic receptor binding profile of para-substituted caramiphen analogues. J Med Chem34:2984-9 (1991) Muscarinic acetylcholine receptor M1
Name:Muscarinic acetylcholine receptor M1
Type:Enzyme Catalytic Domain
Mol. Mass.:51390.46
Organism:RAT
Description:P08482
Residue:460
BDBM50010099
NameBDBM50010099
Synonyms:1-(4-Iodo-phenyl)-cyclopentanecarboxylic acid 2-diethylamino-ethyl ester; hydrochloride | CHEMBL544107
TypeSmall organic molecule
Emp. Form.C18H26INO2
Mol. Mass.415.309
SMILESCCN(CC)CCOC(=O)C1(CCCC1)c1ccc(I)cc1