Reaction Details
TargetMuscarinic acetylcholine receptor M2
LigandBDBM50010098
Substrate/Competitorn/a
Meas. Tech.ChEBML_140189
Ki 432±n/a nM
Citation Hudkins, RLDeHaven-Hudkins, DLStubbins, JF Muscarinic receptor binding profile of para-substituted caramiphen analogues. J Med Chem34:2984-9 (1991) Muscarinic acetylcholine receptor M2
Name:Muscarinic acetylcholine receptor M2
Type:Enzyme Catalytic Domain
Mol. Mass.:51555.53
Organism:RAT
Description:P10980
Residue:466
BDBM50010098
NameBDBM50010098
Synonyms:1-(4-Tetrazol-1-yl-phenyl)-cyclopentanecarboxylic acid 2-diethylamino-ethyl ester; hydrochloride | CHEMBL542915
TypeSmall organic molecule
Emp. Form.C19H27N5O2
Mol. Mass.357.45
SMILESCCN(CC)CCOC(=O)C1(CCCC1)c1ccc(cc1)-n1cnnn1