Reaction Details
TargetKappa-type opioid receptor
LigandBDBM50007344
Substrate/Competitorn/a
Meas. Tech.ChEMBL_145202 (CHEMBL753519)
IC50 6.9±n/a nM
Citation Barlow, JJBlackburn, TPCostello, GFJames, RLe Count, DJMain, BGPearce, RJRussell, KShaw, JS Structure/activity studies related to 2-(3,4-dichlorophenyl)-N-methyl-N-[2-(1-pyrrolidinyl)-1-substituted- ethyl]acetamides: a novel series of potent and selective kappa-opioid agonists. J Med Chem34:3149-58 (1991) Kappa-type opioid receptor
Name:Kappa-type opioid receptor
Type:G Protein-Coupled Receptor (GPCR)
Mol. Mass.:42744.99
Organism:Cavia porcellus (domestic guinea pig)
Description:P41144
Residue:380
BDBM50007344
NameBDBM50007344
Synonyms:(S)-2-(3,4-Dichloro-phenyl)-N-methyl-N-(1-phenyl-2-pyrrolidin-1-yl-ethyl)-acetamide(ICI 199441) 2-(3,4-Dichloro-phenyl)-N-methyl-N-((S)-1-phenyl-2-pyrrolidin-1-yl-ethyl)-acetamide CHEMBL38576 | ICI-199441
TypeSmall organic molecule
Emp. Form.C21H24Cl2N2O
Mol. Mass.391.334
SMILESCN([C@H](CN1CCCC1)c1ccccc1)C(=O)Cc1ccc(Cl)c(Cl)c1