Reaction Details
TargetMuscarinic acetylcholine receptor M3
LigandBDBM50368150
Substrate/Competitorn/a
Meas. Tech.ChEMBL_138978 (CHEMBL742788)
Ki 4.3±n/a nM
Citation Triggle, DJKwon, YWAbraham, PPitner, JBMascarella, SWCarroll, FI Synthesis, molecular modeling studies, and muscarinic receptor activity of azaprophen analogues. J Med Chem34:3164-71 (1991) Muscarinic acetylcholine receptor M3
Name:Muscarinic acetylcholine receptor M3
Type:Enzyme Catalytic Domain
Mol. Mass.:66086.66
Organism:RAT
Description:Cholinergic, muscarinic M3 CHRM3 RAT::P08483
Residue:589
BDBM50368150
NameBDBM50368150
Synonyms:CHEMBL326640
TypeSmall organic molecule
Emp. Form.C22H25NO2
Mol. Mass.335.4394
SMILESCN1CC2CC1CC(C2)OC(=O)C(c1ccccc1)c1ccccc1